BDBM50390831 CHEMBL2070668
SMILES COc1cc(cc2c1nnc1c(C)nc(-c3cccc(F)c3C)n21)C(F)(F)F
InChI Key InChIKey=SUMRAEKZGBJUHZ-UHFFFAOYSA-N
Data  1 IC50
  Tab Delimited (TSV)   2D SDfile   Computed 3D by Vconf -m prep SDfile
Find this compound or compounds like it in BindingDB:
Activity Spreadsheet -- Enzyme Inhibition Constant Data from BindingDB
Found 1 hit for monomerid = 50390831
LigandPNGBDBM50390831(CHEMBL2070668)
Affinity DataIC50:  1.85nM. Assay description: Inhibition of human recombinant PDE10A-catalyzed cAMP hydrolysis
In DepthDetails ArticlePubMed