BDBM50391474 CHEMBL2147197
SMILES CC(C)=CCn1c(nc2n(C)c(=O)[nH]c(=O)c12)N1CCNCC1
InChI Key InChIKey=PMTZAIAYDGLNMJ-UHFFFAOYSA-N
Data  1 IC50
  Tab Delimited (TSV)   2D SDfile   Computed 3D by Vconf -m prep SDfile
Find this compound or compounds like it in BindingDB:
Activity Spreadsheet -- Enzyme Inhibition Constant Data from BindingDB
Found 1 hit for monomerid = 50391474
TargetDipeptidyl peptidase 4(Bos taurus)
Dainippon Sumitomo Pharma
Curated by ChEMBL
LigandPNGBDBM50391474(CHEMBL2147197)
Affinity DataIC50:  676nM. Assay description: Inhibition of bovine DPP4 by HTS assay
In DepthDetails ArticlePubMed