BDBM50392026 CHEMBL2152427
SMILES C[C@@H](NS(=O)(=O)Cc1ccccc1)C(=O)N1CCC[C@H]1C(=O)NCc1cc(Cl)ccc1CN
InChI Key InChIKey=MAUGNQAVJWFOOZ-IERDGZPVSA-N
Data  1 KI
PDB links: 1 PDB ID matches this monomer.
  Tab Delimited (TSV)   2D SDfile   Computed 3D by Vconf -m prep SDfile
Find this compound or compounds like it in BindingDB:
Activity Spreadsheet -- Enzyme Inhibition Constant Data from BindingDB
Found 1 hit for monomerid = 50392026
TargetProthrombin(Homo sapiens (Human))
Philipps University Marburg
Curated by ChEMBL
LigandPNGBDBM50392026(CHEMBL2152427)
Affinity DataKi:  2.20nM. Assay description: Inhibition of human thrombin using Tos-Gly-Pro-Arg-AMC as substrate after 600 secs by fluorimetric method