BDBM50392920 CHEMBL2152218
SMILES Cc1c(Cl)cccc1S(=O)(=O)N1CCC[C@@H]1C(=O)NC1CCCCC1
InChI Key InChIKey=HJDHXRWDPKGUID-MRXNPFEDSA-N
Data  1 IC50
  Tab Delimited (TSV)   2D SDfile   Computed 3D by Vconf -m prep SDfile
Find this compound or compounds like it in BindingDB:
Activity Spreadsheet -- Enzyme Inhibition Constant Data from BindingDB
Found 1 hit for monomerid = 50392920
Target11-beta-hydroxysteroid dehydrogenase 1(Homo sapiens (Human))
TBA
Curated by ChEMBL
LigandPNGBDBM50392920(CHEMBL2152218)
Affinity DataIC50:  8.40E+3nM. Assay description: Inhibition of human 11betaHSD1 by scintillation proximity assay
In DepthDetails ArticlePubMed