BDBM50395185 CHEMBL2164318
SMILES COc1cccc(OCC(=O)Nc2ccc(cc2)-c2nc3ccccc3s2)c1
InChI Key InChIKey=FYJKPCFYYJGKDO-UHFFFAOYSA-N
Data  1 EC50
PDB links: 1 PDB ID matches this monomer.
  Tab Delimited (TSV)   2D SDfile   Computed 3D by Vconf -m prep SDfile
Find this compound or compounds like it in BindingDB:
Activity Spreadsheet -- Enzyme Inhibition Constant Data from BindingDB
Found 1 hit for monomerid = 50395185
TargetHTH-type transcriptional regulator EthR(Mycobacterium tuberculosis)
University Of Lille
Curated by ChEMBL
LigandPNGBDBM50395185(CHEMBL2164318)
Affinity DataEC50:  210nM. Assay description: Inhibition of EthR in Mycobacterium tuberculosis H37Rv-GFP infected in mouse Raw 264.7 cells assessed as compound concentration allowing 0.1 uM ethio...