BDBM50396125 CHEMBL2171323
SMILES COc1cc(\C=C\C(=O)NCCCCCCNc2c3CCCCc3nc3ccccc23)ccc1OCCCCO[N+]([O-])=O
InChI Key InChIKey=KSXDOJVIZJSREQ-HTXNQAPBSA-N
Data  2 IC50
  Tab Delimited (TSV)   2D SDfile   Computed 3D by Vconf -m prep SDfile
Find this compound or compounds like it in BindingDB:
Activity Spreadsheet -- Enzyme Inhibition Constant Data from BindingDB
Found 2 hits for monomerid = 50396125
TargetAcetylcholinesterase(Electrophorus electricus (Electric eel))
China Pharmaceutical University
Curated by ChEMBL
LigandPNGBDBM50396125(CHEMBL2171323)
Affinity DataIC50:  3.70nM. Assay description: Inhibition of eel AChE using acetylthiocholine iodide as substrate after 5 mins by Ellman's method
In DepthDetails ArticlePubMed
TargetCholinesterase(Equus caballus (Horse))
China Pharmaceutical University
Curated by ChEMBL
LigandPNGBDBM50396125(CHEMBL2171323)
Affinity DataIC50:  1.40nM. Assay description: Inhibition of equine serum BuChE using butyrylthiocholine iodide as substrate after 5 mins by Ellman's method
In DepthDetails ArticlePubMed