BDBM50398374 CHEMBL2177376
SMILES C[C@@H]1C[C@@H](O)c2ncnc(N3CCN(CC3)C(=O)[C@H](CNCC(F)(F)F)c3ccc(Cl)cc3)c12
InChI Key InChIKey=RERSEUJKWZVXCS-ZTFGCOKTSA-N
Data  3 IC50
  Tab Delimited (TSV)   2D SDfile   Computed 3D by Vconf -m prep SDfile
Find this compound or compounds like it in BindingDB:
Activity Spreadsheet -- Enzyme Inhibition Constant Data from BindingDB
Found 3 hits for monomerid = 50398374
TargetRAC-beta serine/threonine-protein kinase(Homo sapiens (Human))
Array Biopharma
Curated by ChEMBL
LigandPNGBDBM50398374(CHEMBL2177376)
Affinity DataIC50:  2.01E+3nM. Assay description: Competitive inhibition of wild-type full-length amino-terminal polyhistidine-tagged human Akt2 expressed in recombinant baculovirus system using fluo...
In DepthDetails ArticlePubMed
TargetRAC-gamma serine/threonine-protein kinase(Homo sapiens (Human))
Array Biopharma
Curated by ChEMBL
LigandPNGBDBM50398374(CHEMBL2177376)
Affinity DataIC50:  798nM. Assay description: Competitive inhibition of wild-type full-length amino-terminal polyhistidine-tagged human Akt3 expressed in recombinant baculovirus system using fluo...
In DepthDetails ArticlePubMed
TargetRAC-alpha serine/threonine-protein kinase(Homo sapiens (Human))
Array Biopharma
Curated by ChEMBL
LigandPNGBDBM50398374(CHEMBL2177376)
Affinity DataIC50:  902nM. Assay description: Competitive inhibition of wild-type full-length amino-terminal polyhistidine-tagged human Akt1 expressed in recombinant baculovirus system using fluo...
In DepthDetails ArticlePubMed