BDBM50398384 CHEMBL2177385
SMILES CC(C)NC[C@@H](C(=O)N1CCN(CC1)c1ncnc2CC[C@@H](C)c12)c1ccc(Cl)cc1
InChI Key InChIKey=YIOYTLIENRRHFN-YLJYHZDGSA-N
Data  4 IC50
  Tab Delimited (TSV)   2D SDfile   Computed 3D by Vconf -m prep SDfile
Find this compound or compounds like it in BindingDB:
Activity Spreadsheet -- Enzyme Inhibition Constant Data from BindingDB
Found 4 hits for monomerid = 50398384
TargetRAC-alpha serine/threonine-protein kinase(Homo sapiens (Human))
Array Biopharma
Curated by ChEMBL
LigandPNGBDBM50398384(CHEMBL2177385)
Affinity DataIC50:  6nM. Assay description: Competitive inhibition of wild-type full-length amino-terminal polyhistidine-tagged human Akt1 expressed in recombinant baculovirus system using fluo...
In DepthDetails ArticlePubMed
TargetRAC-gamma serine/threonine-protein kinase(Homo sapiens (Human))
Array Biopharma
Curated by ChEMBL
LigandPNGBDBM50398384(CHEMBL2177385)
Affinity DataIC50:  5nM. Assay description: Competitive inhibition of wild-type full-length amino-terminal polyhistidine-tagged human Akt3 expressed in recombinant baculovirus system using fluo...
In DepthDetails ArticlePubMed
TargetRAC-alpha serine/threonine-protein kinase(Homo sapiens (Human))
Array Biopharma
Curated by ChEMBL
LigandPNGBDBM50398384(CHEMBL2177385)
Affinity DataIC50:  287nM. Assay description: Competitive inhibition of wild-type full-length amino-terminal polyhistidine-tagged human Akt1 expressed in recombinant baculovirus system using fluo...
In DepthDetails ArticlePubMed
TargetRAC-beta serine/threonine-protein kinase(Homo sapiens (Human))
Array Biopharma
Curated by ChEMBL
LigandPNGBDBM50398384(CHEMBL2177385)
Affinity DataIC50:  12nM. Assay description: Competitive inhibition of wild-type full-length amino-terminal polyhistidine-tagged human Akt2 expressed in recombinant baculovirus system using fluo...
In DepthDetails ArticlePubMed