BDBM50403724 CHEMBL2110297
SMILES CC[C@H](C)[C@H]1NC(=O)[C@]2(CCc3ccccc3C2)NC(=O)CCSSC[C@@H](NC(=O)[C@@H](CC(N)=O)NC(=O)[C@H](CCC(N)=O)NC1=O)C(=O)N(C)CC(=O)N[C@@H](CCCNC(N)=N)C(=O)NCC(N)=O
InChI Key InChIKey=LWXMEDXFGOLDEE-CBTNKBIDSA-N
Data  3 Kd
  Tab Delimited (TSV)   2D SDfile   Computed 3D by Vconf -m prep SDfile
Find this compound or compounds like it in BindingDB:
Activity Spreadsheet -- Enzyme Inhibition Constant Data from BindingDB
Found 3 hits for monomerid = 50403724
TargetVasopressin V2 receptor(Rattus norvegicus (Rat))
Albert Szent-Gy£Rgyi Medical University
Curated by ChEMBL
LigandPNGBDBM50403724(CHEMBL2110297)
Affinity DataKd:  5.34E+3nM. Assay description: Compound was evaluated for its dissociation constant (Kd) to rat kidney Vasopressin V2 receptor
In DepthDetails ArticlePubMed
TargetVasopressin V1a/V1b receptor(RAT)
Albert Szent-Gy£Rgyi Medical University
Curated by ChEMBL
LigandPNGBDBM50403724(CHEMBL2110297)
Affinity DataKd:  2.64E+3nM. Assay description: Compound was evaluated for its dissociation constant (Kd) to rat liver Vasopressin V1 receptor
In DepthDetails ArticlePubMed
TargetOxytocin receptor(Homo sapiens (Human))
Albert Szent-Gy£Rgyi Medical University
Curated by ChEMBL
LigandPNGBDBM50403724(CHEMBL2110297)
Affinity DataKd:  1.92E+3nM. Assay description: Compound was evaluated for its dissociation constant (Kd) to guinea pig myometrial Oxytocin receptor
In DepthDetails ArticlePubMed