BDBM50407068 CHEMBL134292
SMILES C[C@@H](NC(=O)N(C[C@@H](O)[C@H](Cc1ccccc1)NC(=O)[C@H](CC(N)=O)NC(=O)OCc1ccccc1)C(C)(C)C)c1ccccc1
InChI Key InChIKey=CHFPVAHIRYQJHQ-QVDUQQMDSA-N
Data  1 IC50
  Tab Delimited (TSV)   2D SDfile   Computed 3D by Vconf -m prep SDfile
Find this compound or compounds like it in BindingDB:
Activity Spreadsheet -- Enzyme Inhibition Constant Data from BindingDB
Found 1 hit for monomerid = 50407068
TargetGag-Pol polyprotein [489-587](Human immunodeficiency virus type 1)
Washington University
Curated by ChEMBL
LigandPNGBDBM50407068(CHEMBL134292)
Affinity DataIC50:  6.50E+3nM. Assay description: Inhibitory potency against HIV-1 protease
In DepthDetails ArticlePubMed