BDBM50408034 CHEMBL148490::Ro-20-7078
SMILES Fc1ccccc1C1=NC(Cl)C(=O)Nc2ccc(Cl)cc12
InChI Key InChIKey=LEXXHNKIUAMGEJ-UHFFFAOYSA-N
Data  1 IC50
  Tab Delimited (TSV)   2D SDfile   Computed 3D by Vconf -m prep SDfile
Find this compound or compounds like it in BindingDB:
Activity Spreadsheet -- Enzyme Inhibition Constant Data from BindingDB
Found 1 hit for monomerid = 50408034
TargetTranslocator protein(Homo sapiens (Human))
Harvard University
Curated by ChEMBL
LigandPNGBDBM50408034(CHEMBL148490 | Ro-20-7078)
Affinity DataIC50:  1.88E+8nM. Assay description: Binding affinity of compound towards Benzodiazepine receptor in a competition assay
In DepthDetails ArticlePubMed