BDBM50412287 CHEMBL477562
SMILES COc1cc2oc(-c3ccc(O)c(O)c3)c(OC)c(=O)c2c(OC)c1OC
InChI Key InChIKey=GILGMPPUIZRTIR-UHFFFAOYSA-N
Data  1 IC50
  Tab Delimited (TSV)   2D SDfile   Computed 3D by Vconf -m prep SDfile
Find this compound or compounds like it in BindingDB:
Activity Spreadsheet -- Enzyme Inhibition Constant Data from BindingDB
Found 1 hit for monomerid = 50412287
TargetAldo-keto reductase family 1 member B1(Rattus norvegicus)
Inifta (Unlp, Cct La Plata-Conicet)
Curated by ChEMBL
LigandPNGBDBM50412287(CHEMBL477562)
Affinity DataIC50:  269nM. Assay description: Inhibition of rat lens aldose reductase
In DepthDetails ArticlePubMed