BDBM50412892 CHEMBL505492
SMILES CCC(=O)N1N=C(CC1c1ccc(F)cc1)c1ccc(OC)cc1
InChI Key InChIKey=YGUOPDGSSBTXSR-UHFFFAOYSA-N
Data  2 IC50
  Tab Delimited (TSV)   2D SDfile   Computed 3D by Vconf -m prep SDfile
Find this compound or compounds like it in BindingDB:
Activity Spreadsheet -- Enzyme Inhibition Constant Data from BindingDB
Found 2 hits for monomerid = 50412892
TargetAmine oxidase [flavin-containing] B(Bos taurus)
Sapienza University Of Rome
Curated by ChEMBL
LigandPNGBDBM50412892(CHEMBL505492)
Affinity DataIC50:  1.00E+5nM. Assay description: Inhibition of bovine mitochondrial MAOB
In DepthDetails ArticlePubMed
TargetAmine oxidase [flavin-containing] A(Bos taurus)
Sapienza University Of Rome
Curated by ChEMBL
LigandPNGBDBM50412892(CHEMBL505492)
Affinity DataIC50:  1.00E+3nM. Assay description: Inhibition of bovine mitochondrial MAOA
In DepthDetails ArticlePubMed