BDBM50419003 CHEMBL1738952
SMILES Brc1c[nH]c(=O)c2cc(sc12)-c1ccncc1
InChI Key InChIKey=YFBJHINTWOTPAK-UHFFFAOYSA-N
Data  1 IC50
PDB links: 1 PDB ID matches this monomer.
  Tab Delimited (TSV)   2D SDfile   Computed 3D by Vconf -m prep SDfile
Find this compound or compounds like it in BindingDB:
Activity Spreadsheet -- Enzyme Inhibition Constant Data from BindingDB
Found 1 hit for monomerid = 50419003
TargetGlycogen synthase kinase-3 beta(Homo sapiens (Human))
Glaxosmithkline
Curated by ChEMBL
LigandPNGBDBM50419003(CHEMBL1738952)
Affinity DataIC50:  158nM. Assay description: Inhibition of human full length His-tagged GSK3-beta expressed in baculovirus by alphaLISA assay