BDBM50420109 CHEMBL2059682
SMILES CCc1c(CN(C)C(C)(C)C(O)=O)cccc1-c1nsc(n1)-c1ccc(OC(C)C)c(c1)C(F)(F)F
InChI Key InChIKey=DVHBAXNQWMZGDW-UHFFFAOYSA-N
Data  2 EC50
  Tab Delimited (TSV)   2D SDfile   Computed 3D by Vconf -m prep SDfile
Find this compound or compounds like it in BindingDB:
Activity Spreadsheet -- Enzyme Inhibition Constant Data from BindingDB
Found 2 hits for monomerid = 50420109
TargetSphingosine 1-phosphate receptor 3(Homo sapiens (Human))
Glaxosmithkline
Curated by ChEMBL
LigandPNGBDBM50420109(CHEMBL2059682)
Affinity DataEC50: >1.00E+4nM. Assay description: Agonist activity against S1P3 receptor by cell based FRET assay
In DepthDetails ArticlePubMed
TargetSphingosine 1-phosphate receptor 1(Homo sapiens (Human))
Glaxosmithkline
Curated by ChEMBL
LigandPNGBDBM50420109(CHEMBL2059682)
Affinity DataEC50:  100nM. Assay description: Agonist activity against S1P1 receptor by cell based FRET assay
In DepthDetails ArticlePubMed