BDBM50422407 CHEMBL2364735
SMILES Nc1ncnc2n(cnc12)[C@@H]1O[C@H](COP([O-])(=O)OP([O-])(=O)OP([O-])([O-])=O)[C@@H](O)[C@H]1O
InChI Key InChIKey=ZKHQWZAMYRWXGA-KQYNXXCUSA-J
Data  1 EC50
  Tab Delimited (TSV)   2D SDfile   Computed 3D by Vconf -m prep SDfile
Find this compound or compounds like it in BindingDB:
Activity Spreadsheet -- Enzyme Inhibition Constant Data from BindingDB
Found 1 hit for monomerid = 50422407
TargetP2Y purinoceptor 1(Rattus norvegicus)
Bar-Ilan University
Curated by ChEMBL
LigandPNGBDBM50422407(CHEMBL2364735)
Affinity DataEC50:  2nM. Assay description: Agonists activity was evaluated by release of [Ca2+] release of HEK 293 cells stably transfected with rat-brain P2Y purinoceptor 1 (P2Y1-R)
In DepthDetails ArticlePubMed