BDBM50423756 CHEMBL611995
SMILES Cc1nc2CCc3cnc(Nc4cccc(O)c4)nc3-c2s1
InChI Key InChIKey=BHDMRJQKCJHJGQ-UHFFFAOYSA-N
Data  3 KI
  Tab Delimited (TSV)   2D SDfile   Computed 3D by Vconf -m prep SDfile
Find this compound or compounds like it in BindingDB:
Activity Spreadsheet -- Enzyme Inhibition Constant Data from BindingDB
Found 3 hits for monomerid = 50423756
TargetCyclin-T1/Cyclin-dependent kinase 9(Homo sapiens (Human))
University Of St. Andrews
Curated by ChEMBL
LigandPNGBDBM50423756(CHEMBL611995)
Affinity DataKi:  32nM. Assay description: inhibition of CDK9/CyclinT1
In DepthDetails ArticlePubMed
TargetCyclin-H/Cyclin-dependent kinase 7(Homo sapiens (Human))
University Of St. Andrews
Curated by ChEMBL
LigandPNGBDBM50423756(CHEMBL611995)
Affinity DataKi:  53nM. Assay description: inhibition of CDK7/Cyclin H/MAT1
In DepthDetails ArticlePubMed
TargetCyclin-dependent kinase/G2/mitotic-specific cyclin- 1(Homo sapiens (Human))
University Of St. Andrews
Curated by ChEMBL
LigandPNGBDBM50423756(CHEMBL611995)
Affinity DataKi:  360nM. Assay description: inhibition of CDK1/Cyclin B
In DepthDetails ArticlePubMed