BDBM50427540 CHEMBL2322277
SMILES Cc1c(CC(=O)Nc2cccc(c2)C(O)=O)c(=O)oc2cc3oc4CCCCc4c3cc12
InChI Key InChIKey=OSNWMBJOOQHQGB-UHFFFAOYSA-N
Data  1 EC50
  Tab Delimited (TSV)   2D SDfile   Computed 3D by Vconf -m prep SDfile
Find this compound or compounds like it in BindingDB:
Activity Spreadsheet -- Enzyme Inhibition Constant Data from BindingDB
Found 1 hit for monomerid = 50427540
TargetNuclear factor NF-kappa-B p105 subunit(Homo sapiens (Human))
Universit£
Curated by ChEMBL
LigandPNGBDBM50427540(CHEMBL2322277)
Affinity DataEC50:  1.00E+5nM. Assay description: Inhibition of human NF-kappaB p50/DNA interaction using 32P-labeled oligonucleotides as substrate preincubated for 20 mins before substrate addition ...
In DepthDetails ArticlePubMed