BDBM50428051 CHEMBL2322621
SMILES Cc1ccc2nc(NC(=O)CNC(=O)c3nn(-c4ccc(F)cc4)c(=O)c4ccccc34)sc2c1
InChI Key InChIKey=FDRCDUCLEJDSAR-UHFFFAOYSA-N
Data  1 EC50
  Tab Delimited (TSV)   2D SDfile   Computed 3D by Vconf -m prep SDfile
Find this compound or compounds like it in BindingDB:
Activity Spreadsheet -- Enzyme Inhibition Constant Data from BindingDB
Found 1 hit for monomerid = 50428051
TargetProtein-serine O-palmitoleoyltransferase porcupine(Mus musculus)
The University Of Texas Southwestern Medical Center
Curated by ChEMBL
LigandPNGBDBM50428051(CHEMBL2322621)
Affinity DataEC50:  100nM. Assay description: Inhibition of porcupine-mediated Wnt signalling in mouse L cells after 24 hrs by SpringerImages-Topflash reporter assay
In DepthDetails ArticlePubMed