BDBM50429035 CHEMBL2334092
SMILES FC(F)c1c(oc2ccccc12)C(=O)Nc1ccc(nc1)N1CCN(CC1)C(=O)Nc1ccccc1F
InChI Key InChIKey=XBGKRHGZIAUWMF-UHFFFAOYSA-N
Data  1 IC50
  Tab Delimited (TSV)   2D SDfile   Computed 3D by Vconf -m prep SDfile
Find this compound or compounds like it in BindingDB:
Activity Spreadsheet -- Enzyme Inhibition Constant Data from BindingDB
Found 1 hit for monomerid = 50429035
TargetDiacylglycerol O-acyltransferase 1(Homo sapiens (Human))
Merck Research Laboratories
Curated by ChEMBL
LigandPNGBDBM50429035(CHEMBL2334092)
Affinity DataIC50:  40nM. Assay description: Inhibition of human DGAT1 expressed in Sf9 cells using 1,2-dioleoyl-sn-glycerol and [14C]-palmitoyl-Co A substrates incubated for 2 hrs by scintillat...
In DepthDetails ArticlePubMed