BDBM50430009 CHEMBL2335049
SMILES CCCCCCCCCCCCCCCCOC(COC)COP(O)([O-])=S
InChI Key InChIKey=ZQTPCGHWXXJLER-UHFFFAOYSA-M
Data  6 EC50
  Tab Delimited (TSV)   2D SDfile   Computed 3D by Vconf -m prep SDfile
Find this compound or compounds like it in BindingDB:
Activity Spreadsheet -- Enzyme Inhibition Constant Data from BindingDB
Found 6 hits for monomerid = 50430009
TargetLysophosphatidic acid receptor 6(Homo sapiens (Human))
The University Of Utah
Curated by ChEMBL
LigandPNGBDBM50430009(CHEMBL2335049)
Affinity DataEC50:  66nM. Assay description: Agonist activity at human LPA6 receptor transfected in HEK293 cells after 1 hr by TGFalpha shedding assay in presence of Ki16425
In DepthDetails ArticlePubMed
TargetLysophosphatidic acid receptor 5(Homo sapiens (Human))
The University Of Utah
Curated by ChEMBL
LigandPNGBDBM50430009(CHEMBL2335049)
Affinity DataEC50:  0.260nM. Assay description: Agonist activity at human LPA5 receptor transfected in HEK293 cells after 1 hr by TGFalpha shedding assay in presence of Ki16425
In DepthDetails ArticlePubMed
TargetLysophosphatidic acid receptor 1(Homo sapiens (Human))
The University Of Utah
Curated by ChEMBL
LigandPNGBDBM50430009(CHEMBL2335049)
Affinity DataEC50:  26nM. Assay description: Agonist activity at human LPA1 receptor transfected in HEK293 cells after 1 hr by TGFalpha shedding assay
In DepthDetails ArticlePubMed
TargetLysophosphatidic acid receptor 3(Homo sapiens (Human))
The University Of Utah
Curated by ChEMBL
LigandPNGBDBM50430009(CHEMBL2335049)
Affinity DataEC50:  0.360nM. Assay description: Agonist activity at human LPA3 receptor transfected in HEK293 cells after 1 hr by TGFalpha shedding assay
In DepthDetails ArticlePubMed
TargetLysophosphatidic acid receptor 2(Homo sapiens (Human))
The University Of Utah
Curated by ChEMBL
LigandPNGBDBM50430009(CHEMBL2335049)
Affinity DataEC50:  116nM. Assay description: Agonist activity at human LPA2 receptor transfected in HEK293 cells after 1 hr by TGFalpha shedding assay
In DepthDetails ArticlePubMed
TargetLysophosphatidic acid receptor 4(Homo sapiens (Human))
The University Of Utah
Curated by ChEMBL
LigandPNGBDBM50430009(CHEMBL2335049)
Affinity DataEC50:  3.80nM. Assay description: Agonist activity at human LPA4 receptor transfected in HEK293 cells after 1 hr by TGFalpha shedding assay in presence of Ki16425
In DepthDetails ArticlePubMed