BDBM50437205 CHEMBL2402572
SMILES Cc1ccccc1[C@H]1[C@@H]2CN(C[C@H]2CC[C@@H]1O[C@H](CO)c1cc(cc(c1)C(F)(F)F)C(F)(F)F)c1nc(O)co1
InChI Key InChIKey=NAIXGBOCBMZFOF-IOOJMYGHSA-N
Data  7 IC50
  Tab Delimited (TSV)   2D SDfile   Computed 3D by Vconf -m prep SDfile
Find this compound or compounds like it in BindingDB:
Activity Spreadsheet -- Enzyme Inhibition Constant Data from BindingDB
Found 7 hits for monomerid = 50437205
TargetNeuromedin-K receptor(Homo sapiens (Human))
Merck Research Laboratories
Curated by ChEMBL
LigandPNGBDBM50437205(CHEMBL2402572)
Affinity DataIC50:  2.50E+3nM. Assay description: Binding affinity to human NK3 receptor
In DepthDetails ArticlePubMed
TargetSubstance-K receptor(Homo sapiens (Human))
Merck Research Laboratories
Curated by ChEMBL
LigandPNGBDBM50437205(CHEMBL2402572)
Affinity DataIC50:  7.20E+3nM. Assay description: Binding affinity to human NK2 receptor
In DepthDetails ArticlePubMed
TargetSubstance-P receptor(Homo sapiens (Human))
Merck Research Laboratories
Curated by ChEMBL
LigandPNGBDBM50437205(CHEMBL2402572)
Affinity DataIC50:  0.75nM. Assay description: Displacement of [125I]substance P from human NK1 receptor expressed in CHO cells in presence of human serum
In DepthDetails ArticlePubMed
TargetCytochrome P450 2C8(Homo sapiens (Human))
Merck Research Laboratories
Curated by ChEMBL
LigandPNGBDBM50437205(CHEMBL2402572)
Affinity DataIC50:  2.10E+4nM. Assay description: Inhibition of human CYP2C8
In DepthDetails ArticlePubMed
TargetCytochrome P450 2D6(Homo sapiens (Human))
Merck Research Laboratories
Curated by ChEMBL
LigandPNGBDBM50437205(CHEMBL2402572)
Affinity DataIC50:  6.10E+4nM. Assay description: Inhibition of human CYP2D6
In DepthDetails ArticlePubMed
TargetCytochrome P450 2C9(Homo sapiens (Human))
Merck Research Laboratories
Curated by ChEMBL
LigandPNGBDBM50437205(CHEMBL2402572)
Affinity DataIC50:  4.10E+4nM. Assay description: Inhibition of human CYP2C9
In DepthDetails ArticlePubMed
TargetSubstance-P receptor(Homo sapiens (Human))
Merck Research Laboratories
Curated by ChEMBL
LigandPNGBDBM50437205(CHEMBL2402572)
Affinity DataIC50:  0.0600nM. Assay description: Displacement of [125I]substance P from human NK1 receptor expressed in CHO cells
In DepthDetails ArticlePubMed