BDBM50447746 CHEMBL3113273
SMILES Fc1ccc(cc1F)-c1ccnc(n1)N1CCN(CC1)C(=O)Nc1cccnn1
InChI Key InChIKey=JCWVFSJNIBAGQN-UHFFFAOYSA-N
Data  2 IC50
  Tab Delimited (TSV)   2D SDfile   Computed 3D by Vconf -m prep SDfile
Find this compound or compounds like it in BindingDB:
Activity Spreadsheet -- Enzyme Inhibition Constant Data from BindingDB
Found 2 hits for monomerid = 50447746
TargetFatty-acid amide hydrolase 1(Homo sapiens (Human))
Takeda Pharmaceutical
Curated by ChEMBL
LigandPNGBDBM50447746(CHEMBL3113273)
Affinity DataIC50:  0.720nM. Assay description: Apparent inhibition of human FAAH expressed in CHOK1 cells using AMCAA as substrate after 30 mins by fluorescence assay
In DepthDetails ArticlePubMed
TargetFatty-acid amide hydrolase 1 [30-579](Rattus norvegicus (rat))
Takeda Pharmaceutical
Curated by ChEMBL
LigandPNGBDBM50447746(CHEMBL3113273)
Affinity DataIC50:  0.280nM. Assay description: Apparent inhibition of rat FAAH using AMCAA as substrate after 30 mins by fluorescence assay
In DepthDetails ArticlePubMed