BDBM50450624 CHEMBL4176696
SMILES ONC(=O)c1cn(nn1)-c1cc(Cl)ccc1Oc1ccc(F)cc1
InChI Key InChIKey=NXLUFTCWMNFMML-UHFFFAOYSA-N
Data  2 IC50
PDB links: 1 PDB ID matches this monomer.
  Tab Delimited (TSV)   2D SDfile   Computed 3D by Vconf -m prep SDfile
Find this compound or compounds like it in BindingDB:
Activity Spreadsheet -- Enzyme Inhibition Constant Data from BindingDB
Found 2 hits for monomerid = 50450624
TargetHistone deacetylase 8(Schistosoma mansoni)
Universit£
Curated by ChEMBL
LigandPNGBDBM50450624(CHEMBL4176696)
Affinity DataIC50:  504nM. Assay description: Inhibition of Schistosoma mansoni His-tagged HDAC8 expressed in Escherichia coli BL21 (DE3) cells using Fluor de Lys (R)-HDAC8 as substrate by fluoro...
Ligand InfoPC cidPC sidPDB
TargetHistone deacetylase 8(Homo sapiens (Human))
Universit£
Curated by ChEMBL
LigandPNGBDBM50450624(CHEMBL4176696)
Affinity DataIC50:  2.20E+3nM. Assay description: Inhibition of human His-thioredoxin-tagged HDAC8 expressed in Escherichia coli BL21 (DE3) cells using Fluor de Lys (R)-HDAC8 as substrate by fluorome...
Ligand InfoPC cidPC sidPDB
In DepthDetails ArticlePubMed