BDBM50452729 CHEMBL1231352
SMILES CN(C)c1nc2CCCn3cc(C4=C(C(=O)NC4=O)c4cn(CCCCc1cc2)c1ccccc41)c1ccccc31
InChI Key InChIKey=WHEOASILVTUPNR-UHFFFAOYSA-N
Data  1 IC50
PDB links: 1 PDB ID matches this monomer.
  Tab Delimited (TSV)   2D SDfile   Computed 3D by Vconf -m prep SDfile
Find this compound or compounds like it in BindingDB:
Activity Spreadsheet -- Enzyme Inhibition Constant Data from BindingDB
Found 1 hit for monomerid = 50452729
TargetGlycogen synthase kinase-3 beta(Homo sapiens (Human))
Peking University
Curated by ChEMBL
LigandPNGBDBM50452729(CHEMBL1231352)
Affinity DataIC50:  3nM. Assay description: Inhibition of human GSK-3beta using YRRAAVPPSPSLSRHSSPHQS(p) EDEEE substrate peptide and [gamma-33P-ATP] incubated for 40 mins by scintillation count...
Ligand InfoPC cidPC sidPDB