BDBM50453373 CHEMBL4210011
SMILES CCCc1cc(=O)[nH]c(Nc2ccccc2F)n1
InChI Key InChIKey=PKDFHRREPYQILX-UHFFFAOYSA-N
Data  1 IC50
PDB links: 1 PDB ID matches this monomer.
  Tab Delimited (TSV)   2D SDfile   Computed 3D by Vconf -m prep SDfile
Find this compound or compounds like it in BindingDB:
Activity Spreadsheet -- Enzyme Inhibition Constant Data from BindingDB
Found 1 hit for monomerid = 50453373
TargetNicotinamide phosphoribosyltransferase(Homo sapiens (Human))TBA
LigandPNGBDBM50453373(CHEMBL4210011)
Affinity DataIC50:  3.60E+5nM. Assay description: Inhibition of human full length C-terminal flag/His-tagged NAMPT (1 to 491 residues) expressed in HEK293-6E cells by TR-FRET assay