BDBM50454226 CHEMBL2063640
SMILES CCOC(=O)C1=C(C)NC(C)=C(C1c1ccccc1)C(=O)OC
InChI Key InChIKey=SCHYNEBURMLCDS-UHFFFAOYSA-N
Data  6 KI
  Tab Delimited (TSV)   2D SDfile   Computed 3D by Vconf -m prep SDfile
Find this compound or compounds like it in BindingDB:
Activity Spreadsheet -- Enzyme Inhibition Constant Data from BindingDB
Found 6 hits for monomerid = 50454226
TargetAdenosine receptor A2a(Rattus norvegicus (rat))
National Institute Of Diabetes
Curated by ChEMBL
LigandPNGBDBM50454226(CHEMBL2063640)
Affinity DataKi:  2.74E+3nM. Assay description: Displacement of specific [3H]-CGS- 21680 binding at Adenosine A2A receptor in rat striatal membranes.
In DepthDetails ArticlePubMed
TargetAdenosine receptor A2a(Rattus norvegicus (rat))
National Institute Of Diabetes
Curated by ChEMBL
LigandPNGBDBM50454226(CHEMBL2063640)
Affinity DataKi:  2.74E+3nM. Assay description: Displacement of [3H]-CGS- 21680 binding to Adenosine A2A receptor in rat striatal membranes
In DepthDetails ArticlePubMed
TargetAdenosine receptor A1(Rattus norvegicus (rat))
National Institute Of Diabetes
Curated by ChEMBL
LigandPNGBDBM50454226(CHEMBL2063640)
Affinity DataKi:  1.10E+4nM. Assay description: Displacement of specific [3H]-(R)-PIA binding at adenosine A1 receptor from rat brain membranes.
In DepthDetails ArticlePubMed
TargetAdenosine receptor A1(Rattus norvegicus (rat))
National Institute Of Diabetes
Curated by ChEMBL
LigandPNGBDBM50454226(CHEMBL2063640)
Affinity DataKi:  1.10E+4nM. Assay description: Displacement of [3H](R)-PIA binding to Adenosine A1 receptor in rat brain membranes
In DepthDetails ArticlePubMed
TargetAdenosine receptor A3(Homo sapiens (Human))
National Institute Of Diabetes
Curated by ChEMBL
LigandPNGBDBM50454226(CHEMBL2063640)
Affinity DataKi:  1.20E+4nM. Assay description: Displacement of specific [125I]-AB-MECA binding at human adenosine A3 receptor.
In DepthDetails ArticlePubMed
TargetAdenosine receptor A3(Homo sapiens (Human))
National Institute Of Diabetes
Curated by ChEMBL
LigandPNGBDBM50454226(CHEMBL2063640)
Affinity DataKi:  1.20E+4nM. Assay description: Displacement of [125]AB-MECA binding to human Adenosine A3 receptor expressed in HEK cells
In DepthDetails ArticlePubMed