BDBM50455878 CHEMBL4210580
SMILES Cc1c(CN2CCC(CC2)Nc2ncnc3sc(CC(F)(F)F)cc23)ccc2n(C[C@H]3CNC(=O)CO3)c(cc12)C#N
InChI Key InChIKey=JTUOGOXWKQAKOR-OAQYLSRUSA-N
Data  1 IC50
PDB links: 1 PDB ID matches this monomer.
  Tab Delimited (TSV)   2D SDfile   Computed 3D by Vconf -m prep SDfile
Find this compound or compounds like it in BindingDB:
Activity Spreadsheet -- Enzyme Inhibition Constant Data from BindingDB
Found 1 hit for monomerid = 50455878
TargetMenin(Homo sapiens (Human))
University Of Michigan
Curated by ChEMBL
LigandPNGBDBM50455878(CHEMBL4210580)
Affinity DataIC50:  123nM. Assay description: Displacement of fluorescein-labeled MLL4-43 from full length human menin expressed in Escherichia coli BL21 (DE3) cells after 3 hrs by fluorescence p...
Ligand InfoPC cidPC sidPDB