BDBM50457614 CHEMBL4202524
SMILES CN1CNS(=O)(=O)c2ccc(CCc3ccc4c(c3)N(C)CNS4(=O)=O)cc12
InChI Key InChIKey=PZUOXMWBXQXKJK-UHFFFAOYSA-N
Data  2 EC50
PDB links: 3 PDB IDs match this monomer.
  Tab Delimited (TSV)   2D SDfile   Computed 3D by Vconf -m prep SDfile
Find this compound or compounds like it in BindingDB:
Activity Spreadsheet -- Enzyme Inhibition Constant Data from BindingDB
Found 2 hits for monomerid = 50457614
TargetGlutamate receptor 2(Homo sapiens (Human))
University Of Liege
Curated by ChEMBL
LigandPNGBDBM50457614(CHEMBL4202524)
Affinity DataEC50:  14.5nM. Assay description: Positive allosteric modulation of GluA2Q flop isoform (unknown origin) expressed in HEK293 cells assessed as increase in L-glutamate induced calcium ...
Ligand InfoPC cidPC sidPDB
TargetGlutamate receptor 2(Homo sapiens (Human))
University Of Liege
Curated by ChEMBL
LigandPNGBDBM50457614(CHEMBL4202524)
Affinity DataEC50:  14nM. Assay description: Positive allosteric modulation of GluA2Q flop isoform (unknown origin) expressed in HEK293 cells assessed as increase in L-glutamate induced calcium ...
Ligand InfoPC cidPC sidPDB