BDBM50457837 CHEMBL4215846
SMILES Cn1cnc(c1)-c1ccc(OC2CCN(CC2)C(=O)Cc2ccc(OC(F)(F)F)cc2)c(c1)C(N)=O
InChI Key InChIKey=VXJAFFGXYYHGQN-UHFFFAOYSA-N
Data  5 IC50
PDB links: 1 PDB ID matches this monomer.
  Tab Delimited (TSV)   2D SDfile   Computed 3D by Vconf -m prep SDfile
Find this compound or compounds like it in BindingDB:
Activity Spreadsheet -- Enzyme Inhibition Constant Data from BindingDB
Found 5 hits for monomerid = 50457837
TargetBDNF/NT-3 growth factors receptor(Homo sapiens (Human))
Pfizer
Curated by ChEMBL
LigandPNGBDBM50457837(CHEMBL4215846)
Affinity DataIC50:  6.10nM. Assay description: Antagonist activity at prolink-tagged TrkB in human U2OS cells assessed as inhibition of BDNF-induced receptor phosphorylation by measuring reduction...
Ligand InfoPC cidPC sidPDB
In DepthDetails ArticlePubMed
TargetNT-3 growth factor receptor(Homo sapiens (Human))
Pfizer
Curated by ChEMBL
LigandPNGBDBM50457837(CHEMBL4215846)
Affinity DataIC50:  2.30nM. Assay description: Antagonist activity at prolink-tagged TrkC in human U2OS cells assessed as inhibition of NT3-induced receptor phosphorylation by measuring reduction ...
Ligand InfoPC cidPC sidPDB
In DepthDetails ArticlePubMed
TargetHigh affinity nerve growth factor receptor(Homo sapiens (Human))
Pfizer
Curated by ChEMBL
LigandPNGBDBM50457837(CHEMBL4215846)
Affinity DataIC50:  7nM. Assay description: Antagonist activity at prolink-tagged TrkA in human U2OS cells assessed as inhibition of beta-NGF-induced receptor phosphorylation by measuring reduc...
Ligand InfoPC cidPC sidPDB
TargetPotassium voltage-gated channel subfamily H member 2(Homo sapiens (Human))
Pfizer
Curated by ChEMBL
LigandPNGBDBM50457837(CHEMBL4215846)
Affinity DataIC50:  9.50E+3nM. Assay description: Inhibition of human ERG by patch express assay
Ligand InfoPC cidPC sidPDB
In DepthDetails ArticlePubMed
TargetPotassium voltage-gated channel subfamily H member 2(Homo sapiens (Human))
Pfizer
Curated by ChEMBL
LigandPNGBDBM50457837(CHEMBL4215846)
Affinity DataIC50:  1.80E+4nM. Assay description: Inhibition of human ERG by fluorescence polarization assay
Ligand InfoPC cidPC sidPDB
In DepthDetails ArticlePubMed