BDBM50457860 CHEMBL4207851
SMILES COc1ccc(NC(=O)N2CCN(CC2)c2nc(N)nc3scnc23)c(C)c1
InChI Key InChIKey=ORDYJLMIDYXYDC-UHFFFAOYSA-N
Data  2 IC50
  Tab Delimited (TSV)   2D SDfile   Computed 3D by Vconf -m prep SDfile
Find this compound or compounds like it in BindingDB:
Activity Spreadsheet -- Enzyme Inhibition Constant Data from BindingDB
Found 2 hits for monomerid = 50457860
TargetPhosphatidylinositol 4-kinase beta(Homo sapiens (Human))
Ucb Pharma
Curated by ChEMBL
LigandPNGBDBM50457860(CHEMBL4207851)
Affinity DataIC50:  35nM. Assay description: Inhibition of PI4K3beta in human PBMC assessed as reduction in mitomycin-C treated human RPMI1788 cells-stimulated lymphocyte proliferation by measur...
Ligand InfoPC cidPC sid
In DepthDetails ArticlePubMed
TargetPhosphatidylinositol 4-kinase beta(Homo sapiens (Human))
Ucb Pharma
Curated by ChEMBL
LigandPNGBDBM50457860(CHEMBL4207851)
Affinity DataIC50:  9nM. Assay description: GRAC: human Y1 selective antagonist
Ligand InfoPC cidPC sid
In DepthDetails ArticlePubMed