BDBM50459438 CHEMBL4218552
SMILES Cc1cc(Cn2c(nc3ccc(Cl)cc23)N2CCNCC2)cc(C)c1F
InChI Key InChIKey=HQRYJQRNCCMWFK-UHFFFAOYSA-N
Data  1 Kd  2 EC50
PDB links: 1 PDB ID matches this monomer.
  Tab Delimited (TSV)   2D SDfile   Computed 3D by Vconf -m prep SDfile
Find this compound or compounds like it in BindingDB:
Activity Spreadsheet -- Enzyme Inhibition Constant Data from BindingDB
Found 3 hits for monomerid = 50459438
TargetSon of sevenless homolog 1(Homo sapiens (Human))
Boehringer Ingelheim Rcv
Curated by ChEMBL
LigandPNGBDBM50459438(CHEMBL4218552)
Affinity DataEC50:  2.12E+4nM. Assay description: Activation of SOS1 in human NCI-H727 cells expressing KRAS G12V mutant assessed as induction of ERK1/2 T202/Y204 phosphorylation incubated for 30 min...
Ligand InfoPC cidPC sidPDB
TargetSon of sevenless homolog 1(Homo sapiens (Human))
Boehringer Ingelheim Rcv
Curated by ChEMBL
LigandPNGBDBM50459438(CHEMBL4218552)
Affinity DataKd:  460nM. Assay description: Binding affinity to human recombinant N-terminal His6-tagged SOS1 (564 to 1049 residues) expressed in BL21-RIL Escherichia coli by fluorescent probe ...
Ligand InfoPC cidPC sidPDB
TargetSon of sevenless homolog 1(Homo sapiens (Human))
Boehringer Ingelheim Rcv
Curated by ChEMBL
LigandPNGBDBM50459438(CHEMBL4218552)
Affinity DataEC50:  1.45E+4nM. Assay description: Activation of SOS1 in human HeLa cells expressing wild type KRAS assessed as induction of ERK1/2 T202/Y204 phosphorylation incubated for 30 mins by I...
Ligand InfoPC cidPC sidPDB