BDBM50462135 CHEMBL1230094
SMILES CCS(=O)(=O)N[C@H](Cc1ccc(cc1)-c1ccccc1)C(=O)N[C@@H](CCC(N)=O)C(=O)NCc1ccc(cc1)C(N)=N
InChI Key InChIKey=DSXLGZNVVMZNSK-IZZNHLLZSA-N
Data  1 IC50
PDB links: 1 PDB ID matches this monomer.
  Tab Delimited (TSV)   2D SDfile   Computed 3D by Vconf -m prep SDfile
Find this compound or compounds like it in BindingDB:
Activity Spreadsheet -- Enzyme Inhibition Constant Data from BindingDB
Found 1 hit for monomerid = 50462135
TargetCoagulation factor VII/Tissue factor(Homo sapiens (Human))
University Of Nottingham
Curated by ChEMBL
LigandPNGBDBM50462135(CHEMBL1230094)
Affinity DataIC50:  93nM. Assay description: Inhibition of human TF/F7a using spectrozyme f7a as substrate
Ligand InfoPC cidPC sidPDB