BDBM50464988 CHEMBL4279174
SMILES CNC(=O)c1ccc(OC)c(c1)C(=O)Nc1cccc(n1)-c1nncn1C(C)C
InChI Key InChIKey=WOQOZRHVLYUXPM-UHFFFAOYSA-N
Data  2 IC50
PDB links: 1 PDB ID matches this monomer.
  Tab Delimited (TSV)   2D SDfile   Computed 3D by Vconf -m prep SDfile
Find this compound or compounds like it in BindingDB:
Activity Spreadsheet -- Enzyme Inhibition Constant Data from BindingDB
Found 2 hits for monomerid = 50464988
TargetMitogen-activated protein kinase kinase kinase 5(Homo sapiens (Human))
Pfizer
Curated by ChEMBL
LigandPNGBDBM50464988(CHEMBL4279174)
Affinity DataIC50:  272nM. Assay description: Inhibition of recombinant full length human ASK1 expressed in HEK293/AP1-Luc cells assessed as reduction in p38 phosphorylation after 18 hrs by HTRF ...
Ligand InfoPC cidPC sidPDB
TargetMitogen-activated protein kinase kinase kinase 5(Homo sapiens (Human))
Pfizer
Curated by ChEMBL
LigandPNGBDBM50464988(CHEMBL4279174)
Affinity DataIC50:  2.40nM. Assay description: Inhibition of recombinant full length human GST-tagged ASK1 expressed in baculovirus expression system using STK3 peptide substrate preincubated for ...
Ligand InfoPC cidPC sidPDB