BDBM50465560 CHEMBL1380070
SMILES C1Cc2nc(cn2C1)-c1ccccc1
InChI Key InChIKey=PPYLPCSLYXBQRM-UHFFFAOYSA-N
Data  1 KI
PDB links: 1 PDB ID matches this monomer.
  Tab Delimited (TSV)   2D SDfile   Computed 3D by Vconf -m prep SDfile
Find this compound or compounds like it in BindingDB:
Activity Spreadsheet -- Enzyme Inhibition Constant Data from BindingDB
Found 1 hit for monomerid = 50465560
TargetWD repeat-containing protein 5(Homo sapiens (Human))
TBA
Curated by ChEMBL
LigandPNGBDBM50465560(CHEMBL1380070)
Affinity DataKi:  3.23E+5nM. Assay description: Binding affinity to N-terminal 6x-His-SUMO tagged WDR5 delta23 deletion mutant (24 to 334 residues) (unknown origin) expressed in Escherichia coli BL...