BDBM50466209 CHEMBL4290066
SMILES CC(C)(C)NC(=O)c1ccc(Nc2nc(ccc2C(N)=O)N2CC[C@@H](C2)NC(=O)C=C)cc1
InChI Key InChIKey=AYRMUHGKVWLINC-KRWDZBQOSA-N
Data  2 IC50
PDB links: 1 PDB ID matches this monomer.
  Tab Delimited (TSV)   2D SDfile   Computed 3D by Vconf -m prep SDfile
Find this compound or compounds like it in BindingDB:
Activity Spreadsheet -- Enzyme Inhibition Constant Data from BindingDB
Found 2 hits for monomerid = 50466209
TargetPotassium voltage-gated channel subfamily H member 2(Homo sapiens (Human))
Emd Serono Research & Development Institute
Curated by ChEMBL
LigandPNGBDBM50466209(CHEMBL4290066)
Affinity DataIC50: >1.00E+4nM. Assay description: Inhibition of human ERG
Ligand InfoPC cidPC sidPDB
In DepthDetails ArticlePubMed
TargetTyrosine-protein kinase BTK(Homo sapiens (Human))
Emd Serono Research & Development Institute
Curated by ChEMBL
LigandPNGBDBM50466209(CHEMBL4290066)
Affinity DataIC50:  7.5nM. Assay description: Inhibition of full length human BTK (8 to 80 residues) using FITC-AHA-EEPLYWSFPAKKK-NH2 as substrate after 90 mins by off-chip mobility shift assay
Ligand InfoPC cidPC sidPDB