BDBM50466891 CHEMBL4281109
SMILES Cn1cc(C2CCN(CC2)C(=O)C2CCCCC2)c2cc(NC(=O)c3cc(ccn3)C#N)ccc12
InChI Key InChIKey=LRJCIDHTWFKTMZ-UHFFFAOYSA-N
Data  1 KI  7 IC50
PDB links: 1 PDB ID matches this monomer.
  Tab Delimited (TSV)   2D SDfile   Computed 3D by Vconf -m prep SDfile
Find this compound or compounds like it in BindingDB:
Activity Spreadsheet -- Enzyme Inhibition Constant Data from BindingDB
Found 8 hits for monomerid = 50466891
TargetNuclear receptor ROR-gamma(Homo sapiens (Human))
Karo Pharma
Curated by ChEMBL
LigandPNGBDBM50466891(CHEMBL4281109)
Affinity DataKi:  20nM. Assay description: Displacement of [3H]-25-hydroxycholesterol from human N-terminal 6His-tagged-RORC2 LBD (259 to 483 residues) expressed in Escherichia coli (DE3) cell...
Ligand InfoPC cidPC sidPDB
TargetNuclear receptor ROR-gamma(Homo sapiens (Human))
Karo Pharma
Curated by ChEMBL
LigandPNGBDBM50466891(CHEMBL4281109)
Affinity DataIC50:  42nM. Assay description: Inverse agonist activity at RORC2 in human Th17 cells assessed as inhibition of IL17A production after 6 days by sandwich ELISA
Ligand InfoPC cidPC sidPDB
TargetNuclear receptor ROR-beta(Homo sapiens (Human))
Karo Pharma
Curated by ChEMBL
LigandPNGBDBM50466891(CHEMBL4281109)
Affinity DataIC50: >3.00E+4nM. Assay description: Inverse agonist activity at RORB (unknown origin) assessed as inhibition of biotinylated co-activator SRC1-2 peptide recruitment after 3 hrs by TR-FR...
Ligand InfoPC cidPC sidPDB
In DepthDetails ArticlePubMed
TargetNuclear receptor ROR-gamma(Homo sapiens (Human))
Karo Pharma
Curated by ChEMBL
LigandPNGBDBM50466891(CHEMBL4281109)
Affinity DataIC50:  120nM. Assay description: Inverse agonist activity at GAL4-fused RORC2 LBD (unknown origin) expressed in mouse neuro2A cells assessed as inhibition of transcriptional activity...
Ligand InfoPC cidPC sidPDB
TargetNuclear receptor ROR-gamma(Homo sapiens (Human))
Karo Pharma
Curated by ChEMBL
LigandPNGBDBM50466891(CHEMBL4281109)
Affinity DataIC50:  5nM. Assay description: Inverse agonist activity at human N-terminal 6His-tagged-RORC2 LBD (259 to 483 residues) expressed in Escherichia coli (DE3) cells assessed as inhibi...
Ligand InfoPC cidPC sidPDB
TargetNuclear receptor ROR-alpha(Homo sapiens (Human))
Karo Pharma
Curated by ChEMBL
LigandPNGBDBM50466891(CHEMBL4281109)
Affinity DataIC50: >3.00E+4nM. Assay description: Inverse agonist activity at GAL4-fused RORA LBD (unknown origin) expressed in mouse neuro2A cells assessed as inhibition of transcriptional activity ...
Ligand InfoPC cidPC sidPDB
In DepthDetails ArticlePubMed
TargetNuclear receptor ROR-beta(Homo sapiens (Human))
Karo Pharma
Curated by ChEMBL
LigandPNGBDBM50466891(CHEMBL4281109)
Affinity DataIC50: >3.00E+4nM. Assay description: Inverse agonist activity at GAL4-fused RORB LBD (unknown origin) expressed in mouse neuro2A cells assessed as inhibition of transcriptional activity ...
Ligand InfoPC cidPC sidPDB
In DepthDetails ArticlePubMed
TargetNuclear receptor ROR-alpha(Homo sapiens (Human))
Karo Pharma
Curated by ChEMBL
LigandPNGBDBM50466891(CHEMBL4281109)
Affinity DataIC50: >3.00E+4nM. Assay description: Inverse agonist activity at RORA (unknown origin) assessed as inhibition of biotinylated co-activator SRC1-2 peptide recruitment after 3 hrs by TR-FR...
Ligand InfoPC cidPC sidPDB
In DepthDetails ArticlePubMed