BDBM50468187 CHEMBL4288634
SMILES COc1ccc(nc1)-c1c([nH]c2cccnc12)-c1ccnc(NC(C)=O)c1
InChI Key InChIKey=VRPRBQAJAQCSCW-UHFFFAOYSA-N
Data  2 IC50
PDB links: 1 PDB ID matches this monomer.
  Tab Delimited (TSV)   2D SDfile   Computed 3D by Vconf -m prep SDfile
Find this compound or compounds like it in BindingDB:
Activity Spreadsheet -- Enzyme Inhibition Constant Data from BindingDB
Found 2 hits for monomerid = 50468187
TargetTGF-beta receptor type-2(Homo sapiens (Human))
Bristol-Myers Squibb Research And Development
Curated by ChEMBL
LigandPNGBDBM50468187(CHEMBL4288634)
Affinity DataIC50: >1.50E+4nM. Assay description: Inhibition of wild type TGFbetaR2 (unknown origin) kinase domain after 1 hr by HTRF assay
In DepthDetails ArticlePubMed
TargetTGF-beta receptor type-1(Homo sapiens (Human))
Bristol-Myers Squibb Research And Development
Curated by ChEMBL
LigandPNGBDBM50468187(CHEMBL4288634)
Affinity DataIC50:  6nM. Assay description: Inhibition of TGFbetaR1 T204D mutant (unknown origin) kinase domain after 1 hr by HTRF assay