BDBM50472494 CHEMBL1161253
SMILES NC(=N)c1cccc(C[C@H](NS(=O)(=O)c2ccc3ccccc3c2)C(=O)N2CCCC[C@@H]2C(O)=O)c1
InChI Key InChIKey=GNANSBQAIRJZPA-XZOQPEGZSA-N
Data  3 KI
PDB links: 1 PDB ID matches this monomer.
  Tab Delimited (TSV)   2D SDfile   Computed 3D by Vconf -m prep SDfile
Find this compound or compounds like it in BindingDB:
Activity Spreadsheet -- Enzyme Inhibition Constant Data from BindingDB
Found 3 hits for monomerid = 50472494
TargetProthrombin(Bos taurus (Bovine))
University Of Marburg
Curated by ChEMBL
LigandPNGBDBM50472494(CHEMBL1161253)
Affinity DataKi:  260nM. Assay description: Binding affinity towards thrombin
Ligand InfoPC cidPC sidPDB
In DepthDetails ArticlePubMed
TargetSerine protease 1(Bos taurus (bovine))
University Of Marburg
Curated by ChEMBL
LigandPNGBDBM50472494(CHEMBL1161253)
Affinity DataKi:  630nM. Assay description: Binding affinity towards trypsin
Ligand InfoPC cidPC sidPDB
TargetCoagulation factor X(Homo sapiens (Human))
University Of Marburg
Curated by ChEMBL
LigandPNGBDBM50472494(CHEMBL1161253)
Affinity DataKi:  3.80E+4nM. Assay description: Binding affinity towards Coagulation factor Xa
Ligand InfoPC cidPC sidPDB
In DepthDetails ArticlePubMed