BDBM50476877 CHEMBL398379
SMILES CCCNC(=O)C(CC)(CC)C(=O)N[C@H]1N=C(c2ccccc2)c2ccccc2N(C)C1=O
InChI Key InChIKey=GUJPHYMIQHZGDO-JOCHJYFZSA-N
Data  1 KI
  Tab Delimited (TSV)   2D SDfile   Computed 3D by Vconf -m prep SDfile
Find this compound or compounds like it in BindingDB:
Activity Spreadsheet -- Enzyme Inhibition Constant Data from BindingDB
Found 1 hit for monomerid = 50476877
TargetPresenilin-1(Homo sapiens (Human))
Bristol-Myers Squibb
Curated by ChEMBL
LigandPNGBDBM50476877(CHEMBL398379)
Affinity DataKi:  227nM. Assay description: Displacement of [3H]succinamide from gamma secretase in THP1 cell membranes
Ligand InfoPC cidPC sid
In DepthDetails ArticlePubMed