BDBM50479792 CHEMBL513225
SMILES Oc1cc(O)c(C(=O)n2cccc2)c(O)c1
InChI Key InChIKey=RYGSNHBTZDYVSS-UHFFFAOYSA-N
Data  1 IC50
PDB links: 1 PDB ID matches this monomer.
  Tab Delimited (TSV)   2D SDfile   Computed 3D by Vconf -m prep SDfile
Find this compound or compounds like it in BindingDB:
Activity Spreadsheet -- Enzyme Inhibition Constant Data from BindingDB
Found 1 hit for monomerid = 50479792
TargetHeat shock protein HSP 90-alpha/90-beta(Homo sapiens (Human))
Pfizer
Curated by ChEMBL
LigandPNGBDBM50479792(CHEMBL513225)
Affinity DataIC50: >2.00E+4nM. Assay description: Inhibition of Hsp90 in human H1299 cells after 24 hrs by Akt luminex assay
Ligand InfoPC cidPC sidPDB