BDBM50482762 CHEMBL1231552
SMILES CC(C)(C)c1cc(ccc1O)C(=O)N1CCOCC1
InChI Key InChIKey=KPZLYGXXDVGCGM-UHFFFAOYSA-N
Data  1 Kd
PDB links: 1 PDB ID matches this monomer.
  Tab Delimited (TSV)   2D SDfile   Computed 3D by Vconf -m prep SDfile
Find this compound or compounds like it in BindingDB:
Activity Spreadsheet -- Enzyme Inhibition Constant Data from BindingDB
Found 1 hit for monomerid = 50482762
TargetHeat shock protein HSP 90-alpha/90-beta(Homo sapiens (Human))
Astex Therapeutics
Curated by ChEMBL
LigandPNGBDBM50482762(CHEMBL1231552)
Affinity DataKd:  1.10E+3nM. Assay description: Binding affinity to human N-terminal ATPase domain of Hsp90 by isothermal titration calorimetry
Ligand InfoPC cidPC sidPDB