BDBM50483106 CHEMBL1276080
SMILES CC(C)CN(C[C@@H](O)[C@H](Cc1ccccc1)NC(=O)[C@@H]1CN(C(=O)O1)c1cccc(OC(F)(F)F)c1)S(=O)(=O)c1ccc2OCOc2c1
InChI Key InChIKey=XJJCSLLWXDVQCT-HFASVGIHSA-N
Data  1 KI
  Tab Delimited (TSV)   2D SDfile   Computed 3D by Vconf -m prep SDfile
Find this compound or compounds like it in BindingDB:
Activity Spreadsheet -- Enzyme Inhibition Constant Data from BindingDB
Found 1 hit for monomerid = 50483106
TargetProtease(Human immunodeficiency virus 1 (HIV-1))
University Of Massachusetts Medical School
Curated by ChEMBL
LigandPNGBDBM50483106(CHEMBL1276080)
Affinity DataKi:  0.239nM. Assay description: Inhibition of wild type HIV1 protease by FRET
Ligand InfoPC cidPC sid
In DepthDetails ArticlePubMed