BDBM50483920 CHEMBL1738737
SMILES COc1cc(c(Cl)cc1Cl)-c1nc(C)nc2[nH]cc(C#N)c12
InChI Key InChIKey=XQAFNWQVIXKAPE-UHFFFAOYSA-N
Data  1 IC50
PDB links: 1 PDB ID matches this monomer.
  Tab Delimited (TSV)   2D SDfile   Computed 3D by Vconf -m prep SDfile
Find this compound or compounds like it in BindingDB:
Activity Spreadsheet -- Enzyme Inhibition Constant Data from BindingDB
Found 1 hit for monomerid = 50483920
TargetHeat shock protein HSP 90-alpha/90-beta(Homo sapiens (Human))
Pfizer
Curated by ChEMBL
LigandPNGBDBM50483920(CHEMBL1738737)
Affinity DataIC50:  1.00E+3nM. Assay description: Inhibition of HSP90 in human H1299 cells assessed as degradation of Akt protein after 24 hrs by luminex assay
Ligand InfoPC cidPC sidPDB