BDBM50491753 CHEMBL2385758
SMILES CC(C)(C)NC(=O)Cc1ccc(Nc2nc(nc3CCCS(=O)(=O)c23)-c2ccccc2)cc1
InChI Key InChIKey=IHIZFBWFXODXJS-UHFFFAOYSA-N
Data  1 IC50
PDB links: 1 PDB ID matches this monomer.
  Tab Delimited (TSV)   2D SDfile   Computed 3D by Vconf -m prep SDfile
Find this compound or compounds like it in BindingDB:
Activity Spreadsheet -- Enzyme Inhibition Constant Data from BindingDB
Found 1 hit for monomerid = 50491753
TargetcAMP-specific 3',5'-cyclic phosphodiesterase 4B(Homo sapiens (Human))
Daiichi Sankyo
Curated by ChEMBL
LigandPNGBDBM50491753(CHEMBL2385758)
Affinity DataIC50:  11nM. Assay description: Inhibition of human recombinant PDE4B (152 to 564 amino acids) using cAMP as substrate after 30 mins by plate reader analysis
Ligand InfoPC cidPC sidPDB