BDBM50496890 CHEMBL3228703
SMILES C[C@H]1C2Cc3ccc(O)cc3C1(C)CCN2CCC#N
InChI Key InChIKey=DHJAHFWTVDJKOO-CDEQTRAXSA-N
Data  3 EC50
  Tab Delimited (TSV)   2D SDfile   Computed 3D by Vconf -m prep SDfile
Find this compound or compounds like it in BindingDB:
Activity Spreadsheet -- Enzyme Inhibition Constant Data from BindingDB
Found 3 hits for monomerid = 50496890
TargetDelta-type/Kappa-type/Mu-type opioid receptor(Rattus norvegicus (rat))
TBA
Curated by ChEMBL
LigandPNGBDBM50496890(CHEMBL3228703)
Affinity DataEC50:  3.00E+3nM. Assay description: Binding affinity to opiate receptor in rat brain homogenates
Ligand InfoPC cidPC sid
In DepthDetails ArticlePubMed
TargetDelta-type/Kappa-type/Mu-type opioid receptor(Rattus norvegicus (rat))
TBA
Curated by ChEMBL
LigandPNGBDBM50496890(CHEMBL3228703)
Affinity DataEC50:  3.00E+3nM. Assay description: Binding affinity to opiate receptor in rat brain homogenates
Ligand InfoPC cidPC sid
In DepthDetails ArticlePubMed
TargetDelta-type/Kappa-type/Mu-type opioid receptor(Rattus norvegicus (rat))
TBA
Curated by ChEMBL
LigandPNGBDBM50496890(CHEMBL3228703)
Affinity DataEC50: >1.00E+8nM. Assay description: Binding affinity to opiate receptor in rat brain homogenates
Ligand InfoPC cidPC sid
In DepthDetails ArticlePubMed