BDBM50498067 CHEMBL3394238
SMILES CCCc1cc2[nH]c(=O)ccc2c(C)n1
InChI Key InChIKey=GNDSCMXBXGHCIV-UHFFFAOYSA-N
Data  1 IC50
PDB links: 1 PDB ID matches this monomer.
  Tab Delimited (TSV)   2D SDfile   Computed 3D by Vconf -m prep SDfile
Find this compound or compounds like it in BindingDB:
Activity Spreadsheet -- Enzyme Inhibition Constant Data from BindingDB
Found 1 hit for monomerid = 50498067
TargetThymidylate kinase(Mycobacterium tuberculosis)
Astrazeneca
Curated by ChEMBL
LigandPNGBDBM50498067(CHEMBL3394238)
Affinity DataIC50:  5.90E+5nM. Assay description: Inhibition of Mycobacterium tuberculosis thymidylate kinase activity by pyruvate kinase-lactate dehydrogenase coupled assay
Ligand InfoPC cidPC sidPDB