BDBM50500205 CHEMBL3746456
SMILES Clc1ccccc1[C@@H](NS(=O)(=O)c1ccc2OCCCOc2c1)c1cc2ccccc2s1
InChI Key InChIKey=TYGYAUYMFQMBTE-XMMPIXPASA-N
Data  1 IC50  2 Kd  1 EC50
PDB links: 1 PDB ID matches this monomer.
  Tab Delimited (TSV)   2D SDfile   Computed 3D by Vconf -m prep SDfile
Find this compound or compounds like it in BindingDB:
Activity Spreadsheet -- Enzyme Inhibition Constant Data from BindingDB
Found 4 hits for monomerid = 50500205
TargetGlucokinase regulatory protein(Homo sapiens (Human))
Amgen
Curated by ChEMBL
LigandPNGBDBM50500205(CHEMBL3746456)
Affinity DataIC50:  17nM. Assay description: Binding affinity to human biotinylated AviTag GKRP assessed as inhibition of protein interaction with fluorescein tagged human glucokinase by AlphaSc...
Ligand InfoPC cidPC sidPDB
TargetHexokinase-4(Homo sapiens (Human))
Amgen
Curated by ChEMBL
LigandPNGBDBM50500205(CHEMBL3746456)
Affinity DataKd: >1.00E+4nM. Assay description: Binding affinity to human glucokinase by surface plasmon resonance analysis
Ligand InfoPC cidPC sidPDB
In DepthDetails ArticlePubMed
TargetGlucokinase regulatory protein(Homo sapiens (Human))
Amgen
Curated by ChEMBL
LigandPNGBDBM50500205(CHEMBL3746456)
Affinity DataKd:  19nM. Assay description: Binding affinity to human GKRP by surface plasmon resonance analysis
Ligand InfoPC cidPC sidPDB
TargetGlucokinase regulatory protein(Mus musculus)
Amgen
Curated by ChEMBL
LigandPNGBDBM50500205(CHEMBL3746456)
Affinity DataEC50:  2.90E+3nM. Assay description: Inhibition of glucokinase-GKRP binding interaction in mouse hepatocytes assessed as induction of glucokinase translocation
Ligand InfoPC cidPC sidPDB
In DepthDetails ArticlePubMed