BDBM50523351 CHEMBL4592596
SMILES NS(=O)(=O)c1ccc(cc1)-n1ncc2ccccc2c1=O
InChI Key InChIKey=ZDPRCKUYDKWLTJ-UHFFFAOYSA-N
Data  4 KI
  Tab Delimited (TSV)   2D SDfile   Computed 3D by Vconf -m prep SDfile
Find this compound or compounds like it in BindingDB:
Activity Spreadsheet -- Enzyme Inhibition Constant Data from BindingDB
Found 4 hits for monomerid = 50523351
TargetCarbonic anhydrase 2(Homo sapiens (Human))
Saint Petersburg State University
Curated by ChEMBL
LigandPNGBDBM50523351(CHEMBL4592596)
Affinity DataKi:  0.230nM. Assay description: Inhibition of human cytosolic CA 2 preincubated for 15 mins by phenol red dye-based stopped-flow CO2 hydration assay
In DepthDetails ArticlePubMed
TargetCarbonic anhydrase 9(Homo sapiens (Human))
Saint Petersburg State University
Curated by ChEMBL
LigandPNGBDBM50523351(CHEMBL4592596)
Affinity DataKi:  0.320nM. Assay description: Inhibition of membrane bound human CA 9 preincubated for 15 mins by phenol red dye-based stopped-flow CO2 hydration assay
In DepthDetails ArticlePubMed
TargetCarbonic anhydrase 12(Homo sapiens (Human))
Saint Petersburg State University
Curated by ChEMBL
LigandPNGBDBM50523351(CHEMBL4592596)
Affinity DataKi:  51nM. Assay description: Inhibition of membrane bound human CA 12 preincubated for 15 mins by phenol red dye-based stopped-flow CO2 hydration assay
In DepthDetails ArticlePubMed
TargetCarbonic anhydrase 1(Homo sapiens (Human))
Saint Petersburg State University
Curated by ChEMBL
LigandPNGBDBM50523351(CHEMBL4592596)
Affinity DataKi:  72nM. Assay description: Inhibition of human cytosolic CA 1 preincubated for 15 mins by phenol red dye-based stopped-flow CO2 hydration assay
In DepthDetails ArticlePubMed