BDBM50595797 CHEMBL5171401
SMILES CCC1(CC)CC(=O)N([C@@H]2CCOc3ccc(cc23)C(=O)N[C@H]2CC(C)(C)Oc3ccccc23)C(=N)N1
InChI Key InChIKey=ZSZSSSHEMYULPX-FCHUYYIVSA-N
Data  2 IC50
PDB links: 2 PDB IDs match this monomer.
  Tab Delimited (TSV)   2D SDfile   Computed 3D by Vconf -m prep SDfile
Find this compound or compounds like it in BindingDB:
Activity Spreadsheet -- Enzyme Inhibition Constant Data from BindingDB
Found 2 hits for monomerid = 50595797
TargetPlasmepsin IX(Plasmodium falciparum (isolate 3D7))
Merck
Curated by ChEMBL
LigandPNGBDBM50595797(CHEMBL5171401)
Affinity DataIC50:  1.40nM. Assay description: Inhibition of Plasmodium falciparum 3D7 HA-glms-tagged PMIX using DABCYL-HSFIQEGKEE-EDANS as substrate measured after 2 hrs by FRET assay
In DepthDetails PubMed
TargetPlasmepsin X(Plasmodium falciparum (isolate 3D7))
Merck
Curated by ChEMBL
LigandPNGBDBM50595797(CHEMBL5171401)
Affinity DataIC50:  0.0300nM. Assay description: Inhibition of Plasmodium falciparum 3D7 HA-glms-tagged PMX using DABCYL-HSFIQEGKEE-EDANS as substrate measured after 2 hrs by FRET assay